Target
Cathepsin L2
Ligand
BDBM50201700
Substrate
Meas. Tech.
ChEMBL_438185 (CHEMBL907578)
IC50
158±n/a nM
Citation
 Epple, RUrbina, HDRusso, RLiu, HMason, DBursulaya, BTumanut, CLi, JHarris, JL Bicyclic carbamates as inhibitors of papain-like cathepsin proteases. Bioorg Med Chem Lett 17:1254-9 (2007)  
Target
Name:
Cathepsin L2
Synonyms:
CATL2 CTSL2 CTSV Cathepsin V
Type:
Enzyme
Mol. Mass.:
37341.06
Organism:
Homo sapiens (Human)
Description:
O60911
Residue:
334
  
Inhibitor
Name:
BDBM50201700
Synonyms:
(1R,2S)-2-phenoxy-7-oxa-5-aza-bicyclo[3.2.1]octan-6-one | CHEMBL230474
Type:
Small organic molecule
Emp. Form.:
C12H13NO3
Mol. Mass.:
219.2365
SMILES:
O=C1O[C@@H]2CN1CC[C@@H]2Oc1ccccc1
: