Target
11-beta-hydroxysteroid dehydrogenase 1
Ligand
BDBM50202087
Substrate
Meas. Tech.
ChEMBL_423354 (CHEMBL909895)
Ki
4±n/a nM
Citation
 Rohde, JJPliushchev, MASorensen, BKWodka, DShuai, QWang, JFung, SMonzon, KMChiou, WJPan, LDeng, XChovan, LERamaiya, AMullally, MHenry, RFStolarik, DFImade, HMMarsh, KCBeno, DWFey, TADroz, BABrune, MECamp, HSSham, HLFrevert, EUJacobson, PBLink, JT Discovery and metabolic stabilization of potent and selective 2-amino-N-(adamant-2-yl) acetamide 11beta-hydroxysteroid dehydrogenase type 1 inhibitors. J Med Chem 50:149-64 (2007)  
Target
Name:
11-beta-hydroxysteroid dehydrogenase 1
Synonyms:
11-DH 11-beta-Hydroxysteroid Dehydrogenase 1 (11-beta-HSD1) 11-beta-hydroxysteroid dehydrogenase 1 (11HSD1) Corticosteroid 11-beta-dehydrogenase isozyme 1 (11-beta-HSD-1) Corticosteroid 11-beta-dehydrogenase isozyme 1 (11beta-HSD1) HSD11 HSD11L | SDR26C1
Type:
Enzyme
Mol. Mass.:
32409.16
Organism:
Homo sapiens (Human)
Description:
P28845
Residue:
292
  
Inhibitor
Name:
BDBM50202087
Synonyms:
CHEMBL374728 | N-[(1R,3S)-5-hydroxy-2-adamantyl]-2-(6,7,9,10-tetrahydro-8H-[1,3]dioxolo[4,5-g][3]benzazepin-8-yl)propanamide
Type:
Small organic molecule
Emp. Form.:
C24H32N2O4
Mol. Mass.:
412.5219
SMILES:
CC(N1CCc2ccc3OCOc3c2CC1)C(=O)N[C@H]1C2CC3CC1C[C@](O)(C3)C2
: