Target
Gastrin/cholecystokinin type B receptor
Ligand
BDBM50202108
Substrate
Meas. Tech.
ChEMBL_423415 (CHEMBL909387)
Ki
>10000±n/a nM
Citation
 Lee, YSAgnes, RSDavis, PMa, SWBadghisi, HLai, JPorreca, FHruby, VJ Partial retro-inverso, retro, and inverso modifications of hydrazide linked bifunctional peptides for opioid and cholecystokinin (CCK) receptors. J Med Chem 50:165-8 (2007)  
Target
Name:
Gastrin/cholecystokinin type B receptor
Synonyms:
CCK-2 receptor CCK-BR CCKRB Cholecystokinin receptor GASR_HUMAN | Gastrin/cholecystokinin type B receptor
Type:
G Protein-Coupled Receptor (GPCR)
Mol. Mass.:
48445.79
Organism:
Homo sapiens (Human)
Description:
Stable expression of human CCK-2 receptors in HEK 293 cells.
Residue:
447
  
Inhibitor
Name:
BDBM50202108
Synonyms:
(3S)-3-{[(2S)-1-[(2S)-2-{2-[(2R)-2-[(2S)-2-amino-3-(4-hydroxyphenyl)propanamido]propanamido]acetamido}-3-phenylpropanehydrazido]-1-oxo-3-phenylpropan-2-yl]carbamoyl}-3-[(2S)-2-[(2R)-2-{[(tert-butoxy)carbonyl]amino}-3-(1H-indol-2-yl)propanamido]hexanamido]propanoic acid | CHEMBL414087
Type:
Small organic molecule
Emp. Form.:
C58H73N11O13
Mol. Mass.:
1132.2661
SMILES:
CCCC[C@H](NC(=O)[C@@H](Cc1cc2ccccc2[nH]1)NC(=O)OC(C)(C)C)C(=O)N[C@@H](CC(O)=O)C(=O)N[C@@H](Cc1ccccc1)C(=O)NNC(=O)[C@H](Cc1ccccc1)NC(=O)CNC(=O)[C@@H](C)NC(=O)[C@@H](N)Cc1ccc(O)cc1
: