Target
A disintegrin and metalloproteinase with thrombospondin motifs 5
Ligand
BDBM50202158
Substrate
Meas. Tech.
ChEMBL_438214 (CHEMBL907607)
IC50
3500±n/a nM
Citation
 Bursavich, MGGilbert, AMLombardi, SGeorgiadis, KEReifenberg, EFlannery, CRMorris, EA Synthesis and evaluation of aryl thioxothiazolidinone inhibitors of ADAMTS-5 (Aggrecanase-2). Bioorg Med Chem Lett 17:1185-8 (2007)  
Target
Name:
A disintegrin and metalloproteinase with thrombospondin motifs 5
Synonyms:
A disintegrin and metalloproteinase with thrombospondin motifs 5 (ADAMTS-5) ADAMTS5 ATS5_HUMAN Metalloproteinase with thrombospondin motifs 5 (ADAMTS-5)
Type:
Enzyme
Mol. Mass.:
101769.09
Organism:
Homo sapiens (Human)
Description:
Q9UNA0
Residue:
930
  
Inhibitor
Name:
BDBM50202158
Synonyms:
5-(4-(4-chlorobenzyloxy)-3-methoxybenzylidene)-2-thioxothiazolidin-4-one | CHEMBL395503
Type:
Small organic molecule
Emp. Form.:
C18H14ClNO3S2
Mol. Mass.:
391.892
SMILES:
COc1cc(C=C2SC(=S)NC2=O)ccc1OCc1ccc(Cl)cc1
: