Target
Delta-type opioid receptor
Ligand
BDBM50202506
Substrate
Meas. Tech.
ChEMBL_423718 (CHEMBL855468)
Ki
1.5±n/a nM
Citation
 Tóth, GIoja, ETömböly, CBallet, STourwé, DPéter, AMartinek, TChung, NNSchiller, PWBenyhe, SBorsodi, A Beta-methyl substitution of cyclohexylalanine in Dmt-Tic-Cha-Phe peptides results in highly potent delta opioid antagonists. J Med Chem 50:328-33 (2007)  
Target
Name:
Delta-type opioid receptor
Synonyms:
Cytochrome P450 3A4 Delta opioid receptor Delta-type opioid receptor (DOR) OPRD_RAT Opioid receptor Opioid receptors; mu & delta Ror-a | Voltage-gated potassium channel
Type:
G Protein-Coupled Receptor (GPCR)
Mol. Mass.:
40465.04
Organism:
Rattus norvegicus (rat)
Description:
Competition binding assays were using CHO-K1 cell membranes expressing the opioid receptor.
Residue:
372
  
Inhibitor
Name:
BDBM50202506
Synonyms:
CHEMBL376453 | H-Dmt-Tic-(2R,3S)-beta-MeCha-Phe-OH
Type:
Small organic molecule
Emp. Form.:
C40H50N4O6
Mol. Mass.:
682.8482
SMILES:
C[C@H]([C@@H](NC(=O)C1Cc2ccccc2CN1C(=O)[C@@H](N)Cc1c(C)cc(O)cc1C)C(=O)N[C@@H](Cc1ccccc1)C(O)=O)C1CCCCC1
: