Target
Melanin-concentrating hormone receptor 1
Ligand
BDBM50197139
Substrate
Meas. Tech.
ChEMBL_421700 (CHEMBL854908)
IC50
3±n/a nM
Citation
 Iyengar, RRLynch, JKMulhern, MMJudd, ASFreeman, JCGao, JSouers, AJZhao, GWodka, DDoug Falls, HBrodjian, SDayton, BDReilly, RMSwanson, SSu, ZMartin, RLLeitza, STHouseman, KADiaz, GCollins, CASham, HLKym, PR An evaluation of 3,4-methylenedioxy phenyl replacements in the aminopiperidine chromone class of MCHr1 antagonists. Bioorg Med Chem Lett 17:874-8 (2007)  
Target
Name:
Melanin-concentrating hormone receptor 1
Synonyms:
G-protein coupled receptor 24 MCH receptor 1 MCH-R1 MCHR-1 MCHR1_HUMAN Melanin-Concentrating Hormone Receptor 1 (MCH1R) Melanin-concentrating hormone receptor 1 (MCH-1) Melanin-concentrating hormone receptor 1 (MCHR-1) SLC-1 Somatostatin receptor-like protein
Type:
G Protein-Coupled Receptor (GPCR)
Mol. Mass.:
45976.27
Organism:
Homo sapiens (Human)
Description:
Membranes from CHO-K1 cells stably expressing human MCH1R were used in assays.
Residue:
422
  
Inhibitor
Name:
BDBM50197139
Synonyms:
CHEMBL214021 N-[1-(1,3-benzodioxol-5-ylmethyl)piperidin-4-yl]-7-fluoro-4-oxo-4H-chromene-2-carboxamide
Type:
Small organic molecule
Emp. Form.:
C23H21FN2O5
Mol. Mass.:
424.4216
SMILES:
Fc1ccc2c(c1)oc(cc2=O)C(=O)NC1CCN(Cc2ccc3OCOc3c2)CC1
: