Target
Tyrosine-protein kinase Fgr
Ligand
BDBM50202735
Substrate
Meas. Tech.
ChEMBL_446811 (CHEMBL897110)
IC50
21700±n/a nM
Citation
 Abbott, LBetschmann, PBurchat, ACalderwood, DJDavis, HHrnciar, PHirst, GCLi, BMorytko, MMullen, KYang, B Discovery of thienopyridines as Src-family selective Lck inhibitors. Bioorg Med Chem Lett 17:1167-71 (2007)  
Target
Name:
Tyrosine-protein kinase Fgr
Synonyms:
FGR Gardner-Rasheed feline sarcoma viral (v-fgr) oncogene homolog SRC p55-Fgr p58c-Fgr
Type:
protein
Mol. Mass.:
59469.88
Organism:
Homo sapiens (Human)
Description:
P09769
Residue:
529
  
Inhibitor
Name:
BDBM50202735
Synonyms:
CHEMBL395666 | N-(4-(4-amino-7-(3-((1s,4s)-4-aminocyclohexylamino)prop-1-enyl)thieno[3,2-c]pyridin-3-yl)-2-methoxyphenyl)-1-methyl-1H-indole-2-carboxamide
Type:
Small organic molecule
Emp. Form.:
C33H36N6O2S
Mol. Mass.:
580.743
SMILES:
COc1cc(ccc1NC(=O)c1cc2ccccc2n1C)-c1csc2c(\C=C\CN[C@@H]3CC[C@H](N)CC3)cnc(N)c12
: