Target
Malonyl-CoA decarboxylase, mitochondrial
Ligand
BDBM50202804
Substrate
Meas. Tech.
ChEMBL_454062 (CHEMBL903253)
IC50
1531±n/a nM
Citation
 Wallace, DMHaramura, MCheng, JFArrhenius, TNadzan, AM Novel trifluoroacetophenone derivatives as malonyl-CoA decarboxylase inhibitors. Bioorg Med Chem Lett 17:1127-30 (2007)  
Target
Name:
Malonyl-CoA decarboxylase, mitochondrial
Synonyms:
DCMC_HUMAN Malonyl-CoA decarboxylase
Type:
PROTEIN
Mol. Mass.:
55018.37
Organism:
Homo sapiens (Human)
Description:
ChEMBL_665404
Residue:
493
  
Inhibitor
Name:
BDBM50202804
Synonyms:
CHEMBL247463 | N-isobutyl-4-(2,2,2-trifluoroacetyl)benzamide
Type:
Small organic molecule
Emp. Form.:
C13H14F3NO2
Mol. Mass.:
273.251
SMILES:
CC(C)CNC(=O)c1ccc(cc1)C(=O)C(F)(F)F
: