Target
Adenosine receptor A2a
Ligand
BDBM50202995
Substrate
Meas. Tech.
ChEMBL_454087 (CHEMBL903278)
Ki
2.2±n/a nM
Citation
 Neustadt, BRHao, JLindo, NGreenlee, WJStamford, AWTulshian, DOngini, EHunter, JMonopoli, ABertorelli, RFoster, CArik, LLachowicz, JNg, KFeng, KI Potent, selective, and orally active adenosine A2A receptor antagonists: arylpiperazine derivatives of pyrazolo[4,3-e]-1,2,4-triazolo[1,5-c]pyrimidines. Bioorg Med Chem Lett 17:1376-80 (2007)  
Target
Name:
Adenosine receptor A2a
Synonyms:
A2A adenosine receptor (hA2A) ADENOSINE A2 ADORA2 Adenosine A2A receptor (A2AAR)
Type:
G Protein-Coupled Receptor (GPCR)
Mol. Mass.:
44716.46
Organism:
Homo sapiens (Human)
Description:
P29274
Residue:
412
  
Inhibitor
Name:
BDBM50202995
Synonyms:
2-furan-2-yl-7-{2-[4-(4-methanesulfinylmethoxy-phenyl)-piperazin-1-yl]-ethyl}-7H-pyrazolo[4,3-e][1,2,4]triazolo[1,5-c]pyrimidin-5-ylamine | CHEMBL240647
Type:
Small organic molecule
Emp. Form.:
C24H27N9O3S
Mol. Mass.:
521.595
SMILES:
CS(=O)COc1ccc(cc1)N1CCN(CCn2ncc3c2nc(N)n2nc(nc32)-c2ccco2)CC1
: