Target
Interstitial collagenase
Ligand
BDBM50203537
Substrate
Meas. Tech.
ChEMBL_425538 (CHEMBL911375)
IC50
>5000±n/a nM
Citation
 Yao, WZhuo, JBurns, DMXu, MZhang, CLi, YLQian, DQHe, CWeng, LShi, ELin, QAgrios, CBurn, TCCaulder, ECovington, MBFridman, JSFriedman, SKatiyar, KHollis, GLi, YLiu, CLiu, XMarando, CANewton, RPan, MScherle, PTaylor, NVaddi, KWasserman, ZRWynn, RYeleswaram, SJalluri, RBower, MZhou, BBMetcalf, B Discovery of a potent, selective, and orally active human epidermal growth factor receptor-2 sheddase inhibitor for the treatment of cancer. J Med Chem 50:603-6 (2007)  
Target
Name:
Interstitial collagenase
Synonyms:
CLG MMP1 Matrix metalloproteinase-1 | Matrix metalloproteinase-1 (MMP-1)
Type:
Enzyme
Mol. Mass.:
54010.26
Organism:
Homo sapiens (Human)
Description:
P03956
Residue:
469
  
Inhibitor
Name:
BDBM50203537
Synonyms:
(6S,7S)-6-(4-phenyl-piperidine-1-carbonyl)-5-aza-spiro[2.5]octane-7-carboxylic acid hydroxyamide CHEMBL219104
Type:
Small organic molecule
Emp. Form.:
C20H27N3O3
Mol. Mass.:
357.4467
SMILES:
ONC(=O)[C@H]1CC2(CC2)CN[C@@H]1C(=O)N1CCC(CC1)c1ccccc1
: