Target
C-C chemokine receptor type 8
Ligand
BDBM50203881
Substrate
Meas. Tech.
ChEMBL_425772 (CHEMBL855762)
Ki
1.6±n/a nM
Citation
 Jenkins, TJGuan, BDai, MLi, GLightburn, TEHuang, SFreeze, BSBurdi, DFJacutin-Porte, SBennett, RChen, WMinor, CGhosh, SBlackburn, CGigstad, KMJones, MKolbeck, RYin, WSmith, SCardillo, DOcain, TDHarriman, GC Design, synthesis, and evaluation of naphthalene-sulfonamide antagonists of human CCR8. J Med Chem 50:566-84 (2007)  
Target
Name:
C-C chemokine receptor type 8
Synonyms:
CCR8 CKRL1 CMKBRL2
Type:
PROTEIN
Mol. Mass.:
40855.53
Organism:
Homo sapiens (Human)
Description:
ChEMBL_454278
Residue:
355
  
Inhibitor
Name:
BDBM50203881
Synonyms:
4-[4-(2-methyl-benzoylamino)-naphthalene-1-sulfonylamino]-piperidine-1-carboxylic acid ethyl ester | CHEMBL218375
Type:
Small organic molecule
Emp. Form.:
C26H29N3O5S
Mol. Mass.:
495.591
SMILES:
CCOC(=O)N1CCC(CC1)NS(=O)(=O)c1ccc(NC(=O)c2ccccc2C)c2ccccc12
: