Target
C-C chemokine receptor type 8
Ligand
BDBM50203894
Substrate
Meas. Tech.
ChEMBL_425774 (CHEMBL855766)
IC50
23.6±n/a nM
Citation
 Jenkins, TJGuan, BDai, MLi, GLightburn, TEHuang, SFreeze, BSBurdi, DFJacutin-Porte, SBennett, RChen, WMinor, CGhosh, SBlackburn, CGigstad, KMJones, MKolbeck, RYin, WSmith, SCardillo, DOcain, TDHarriman, GC Design, synthesis, and evaluation of naphthalene-sulfonamide antagonists of human CCR8. J Med Chem 50:566-84 (2007)  
Target
Name:
C-C chemokine receptor type 8
Synonyms:
CCR8 CKRL1 CMKBRL2
Type:
PROTEIN
Mol. Mass.:
40855.53
Organism:
Homo sapiens (Human)
Description:
ChEMBL_454278
Residue:
355
  
Inhibitor
Name:
BDBM50203894
Synonyms:
CHEMBL374414 | N-(4-{[(1-butyrylpiperidin-4-yl)amino]sulfonyl}-1-naphthyl)-1-benzothiophene-2-carboxamide
Type:
Small organic molecule
Emp. Form.:
C28H29N3O4S2
Mol. Mass.:
535.678
SMILES:
CCCC(=O)N1CCC(CC1)NS(=O)(=O)c1ccc(NC(=O)c2cc3ccccc3s2)c2ccccc12
: