Target
Glutamate receptor ionotropic, NMDA 2B
Ligand
BDBM50204898
Substrate
Meas. Tech.
ChEMBL_428114 (CHEMBL914283)
IC50
107±n/a nM
Citation
 Borza, IBozó, EBarta-Szalai, GKiss, CTárkányi, GDemeter, AGáti, THáda, VKolok, SGere, AFodor, LNagy, JGalgóczy, KMagdó, IAgai, BFetter, JBertha, FKeserü, GMHorváth, CFarkas, SGreiner, IDomány, G Selective NR1/2B N-methyl-D-aspartate receptor antagonists among indole-2-carboxamides and benzimidazole-2-carboxamides. J Med Chem 50:901-14 (2007)  
Target
Name:
Glutamate receptor ionotropic, NMDA 2B
Synonyms:
GluN2B Grin2b NMDA receptor subunit N2B (GluN2B) NMDE2_RAT | NR2B
Type:
Protein
Mol. Mass.:
166077.66
Organism:
Rattus norvegicus (Rat)
Description:
Q00960
Residue:
1482
  
Inhibitor
Name:
BDBM50204898
Synonyms:
(6-hydroxy-1H-indole-2-yl)-(4-phenoxypiperidine)-methanone | CHEMBL426731
Type:
Small organic molecule
Emp. Form.:
C20H20N2O3
Mol. Mass.:
336.3844
SMILES:
Oc1ccc2cc([nH]c2c1)C(=O)N1CCC(CC1)Oc1ccccc1
: