Target
Cyclin-dependent kinase 5 activator 1
Ligand
BDBM50204948
Substrate
Meas. Tech.
ChEMBL_442225 (CHEMBL892384)
IC50
356±n/a nM
Citation
 Shiradkar, MRAkula, KCDasari, VBaru, VChiningiri, BGandhi, SKaur, R Clubbed thiazoles by MAOS: a novel approach to cyclin-dependent kinase 5/p25 inhibitors as a potential treatment for Alzheimer's disease. Bioorg Med Chem 15:2601-10 (2007)  
Target
Name:
Cyclin-dependent kinase 5 activator 1
Synonyms:
CDK5/p35 Cyclin-dependent kinase 5 regulatory subunit 1 | Cyclin-dependent kinase 5/CDK5 activator 1
Type:
Protein Complex
Mol. Mass.:
Description:
Components:
This complex has 2 components.
Component 1
Name:
Cyclin-dependent kinase 5
Synonyms:
CDK5 CDKN5 Cyclin-dependent kinase 5 (CDK5/ p25) Cyclin-dependent-like kinase 5 PSSALRE Tau protein kinase II catalytic subunit
Type:
Enzyme Subunit
Mol. Mass.:
33308.61
Organism:
Homo sapiens (Human)
Description:
Residue:
292
  
Component 2
Name:
Cyclin-dependent kinase 5 activator 1
Synonyms:
CD5R1_HUMAN CDK5R1 Cyclin-dependent kinase 5 (CDK5/p25) NCK5A p35
Type:
Enzyme Subunit
Mol. Mass.:
34077.43
Organism:
Homo sapiens (Human)
Description:
Q15078
Residue:
307
  
Inhibitor
Name:
BDBM50204948
Synonyms:
CHEMBL437951 N-{3-[2-(N'-acetyl-hydrazino)-2-oxo-ethylsulfanyl]-5-[2-(2-chloro-acetylamino)-thiazol-4-ylmethyl]-[1,2,4]triazol-4-yl}-benzamide
Type:
Small organic molecule
Emp. Form.:
C19H19ClN8O4S2
Mol. Mass.:
522.988
SMILES:
CC(=O)NNC(=O)CSc1nnc(Cc2csc(NC(=O)CCl)n2)n1NC(=O)c1ccccc1
: