Target
Cyclin-dependent kinase 5 activator 1
Ligand
BDBM50204964
Substrate
Meas. Tech.
ChEMBL_442225 (CHEMBL892384)
IC50
436±n/a nM
Citation
 Shiradkar, MRAkula, KCDasari, VBaru, VChiningiri, BGandhi, SKaur, R Clubbed thiazoles by MAOS: a novel approach to cyclin-dependent kinase 5/p25 inhibitors as a potential treatment for Alzheimer's disease. Bioorg Med Chem 15:2601-10 (2007)  
Target
Name:
Cyclin-dependent kinase 5 activator 1
Synonyms:
CDK5/p35 Cyclin-dependent kinase 5 regulatory subunit 1 | Cyclin-dependent kinase 5/CDK5 activator 1
Type:
Protein Complex
Mol. Mass.:
Description:
Components:
This complex has 2 components.
Component 1
Name:
Cyclin-dependent kinase 5
Synonyms:
CDK5 CDKN5 Cyclin-dependent kinase 5 (CDK5/ p25) Cyclin-dependent-like kinase 5 PSSALRE Tau protein kinase II catalytic subunit
Type:
Enzyme Subunit
Mol. Mass.:
33308.61
Organism:
Homo sapiens (Human)
Description:
Residue:
292
  
Component 2
Name:
Cyclin-dependent kinase 5 activator 1
Synonyms:
CD5R1_HUMAN CDK5R1 Cyclin-dependent kinase 5 (CDK5/p25) NCK5A p35
Type:
Enzyme Subunit
Mol. Mass.:
34077.43
Organism:
Homo sapiens (Human)
Description:
Q15078
Residue:
307
  
Inhibitor
Name:
BDBM50204964
Synonyms:
CHEMBL234572 | N-(4-{4-acetylamino-5-[2-(N'-benzoyl-hydrazino)-2-oxo-ethylsulfanyl]-4H-[1,2,4]triazol-3-ylmethyl}-thiazol-2-yl)-acetamide
Type:
Small organic molecule
Emp. Form.:
C19H20N8O4S2
Mol. Mass.:
488.543
SMILES:
CC(=O)Nc1nc(Cc2nnc(SCC(=O)NNC(=O)c3ccccc3)n2NC(C)=O)cs1
: