Target
Cyclin-dependent kinase 5 activator 1
Ligand
BDBM50205015
Substrate
Meas. Tech.
ChEMBL_442225 (CHEMBL892384)
IC50
894±n/a nM
Citation
 Shiradkar, MRAkula, KCDasari, VBaru, VChiningiri, BGandhi, SKaur, R Clubbed thiazoles by MAOS: a novel approach to cyclin-dependent kinase 5/p25 inhibitors as a potential treatment for Alzheimer's disease. Bioorg Med Chem 15:2601-10 (2007)  
Target
Name:
Cyclin-dependent kinase 5 activator 1
Synonyms:
CDK5/p35 Cyclin-dependent kinase 5 regulatory subunit 1 | Cyclin-dependent kinase 5/CDK5 activator 1
Type:
Protein Complex
Mol. Mass.:
Description:
Components:
This complex has 2 components.
Component 1
Name:
Cyclin-dependent kinase 5
Synonyms:
CDK5 CDKN5 Cyclin-dependent kinase 5 (CDK5/ p25) Cyclin-dependent-like kinase 5 PSSALRE Tau protein kinase II catalytic subunit
Type:
Enzyme Subunit
Mol. Mass.:
33308.61
Organism:
Homo sapiens (Human)
Description:
Residue:
292
  
Component 2
Name:
Cyclin-dependent kinase 5 activator 1
Synonyms:
CD5R1_HUMAN CDK5R1 Cyclin-dependent kinase 5 (CDK5/p25) NCK5A p35
Type:
Enzyme Subunit
Mol. Mass.:
34077.43
Organism:
Homo sapiens (Human)
Description:
Q15078
Residue:
307
  
Inhibitor
Name:
BDBM50205015
Synonyms:
CHEMBL242997 N-[3-({2-[benzoylamino]-1,3-thiazol-4-yl}methyl)-5-sulfanyl-4H-1,2,4-triazol-4-yl]benzamide
Type:
Small organic molecule
Emp. Form.:
C20H16N6O2S2
Mol. Mass.:
436.51
SMILES:
O=C(Nc1nc(Cc2n[nH]c(=S)n2NC(=O)c2ccccc2)cs1)c1ccccc1
: