Target
Dipeptidyl peptidase 4
Ligand
BDBM50205125
Substrate
Meas. Tech.
ChEMBL_442235 (CHEMBL892394)
IC50
2.9±n/a nM
Citation
 Kondo, TSugimoto, INekado, TOchi, KOhtani, TTajima, YYamamoto, SKawabata, KNakai, HToda, M Design and synthesis of long-acting inhibitors of dipeptidyl peptidase IV. Bioorg Med Chem 15:2715-35 (2007)  
Target
Name:
Dipeptidyl peptidase 4
Synonyms:
ADABP Adenosine deaminase complexing protein 2 CD_antigen=CD26 DPP4 DPPIV Dipeptidyl peptidase 4 (DPP IV) Dipeptidyl peptidase 4 (DPP4) Dipeptidyl peptidase 4 membrane form Dipeptidyl peptidase IV Dipeptidyl peptidase IV (DDP-IV) Dipeptidyl peptidase IV membrane form Dipeptidyl peptidase-IV (DPP-4) T-cell activation antigen CD26 | TP103
Type:
Enzyme
Mol. Mass.:
88271.01
Organism:
Homo sapiens (Human)
Description:
P27487
Residue:
766
  
Inhibitor
Name:
BDBM50205125
Synonyms:
(2S)-1-{[(2S,4S)-4-isobutyl-2-pyrrolidinyl]carbonyl}-2-pyrrolidinecarbonitrile | CHEMBL242987
Type:
Small organic molecule
Emp. Form.:
C14H23N3O
Mol. Mass.:
249.3519
SMILES:
CC(C)C[C@@H]1CN[C@@H](C1)C(=O)N1CCC[C@H]1C#N
: