Target
Prostaglandin E2 receptor EP2 subtype
Ligand
BDBM50205275
Substrate
Meas. Tech.
ChEMBL_425873 (CHEMBL856877)
Ki
136±n/a nM
Citation
 Sturino, CFO'Neill, GLachance, NBoyd, MBerthelette, CLabelle, MLi, LRoy, BScheigetz, JTsou, NAubin, YBateman, KPChauret, NDay, SHLévesque, JFSeto, CSilva, JHTrimble, LACarriere, MCDenis, DGreig, GKargman, SLamontagne, SMathieu, MCSawyer, NSlipetz, DAbraham, WMJones, TMcAuliffe, MPiechuta, HNicoll-Griffith, DAWang, ZZamboni, RYoung, RNMetters, KM Discovery of a potent and selective prostaglandin D2 receptor antagonist, [(3R)-4-(4-chloro-benzyl)-7-fluoro-5-(methylsulfonyl)-1,2,3,4-tetrahydrocyclopenta[b]indol-3-yl]-acetic acid (MK-0524). J Med Chem 50:794-806 (2007)  
Target
Name:
Prostaglandin E2 receptor EP2 subtype
Synonyms:
PE2R2_HUMAN PTGER2 Prostaglandin E2 receptor Prostanoid EP2 Receptor
Type:
Enzyme
Mol. Mass.:
39775.71
Organism:
Homo sapiens (Human)
Description:
P43116
Residue:
358
  
Inhibitor
Name:
BDBM50205275
Synonyms:
CHEMBL426559 | [(3R)-4-(4-chlorobenzyl)-7-fluoro-5-(methylsulfonyl)-1,2,3,4-tetrahydrocyclopenta[b]indol-3-yl]-acetic acid
Type:
Small organic molecule
Emp. Form.:
C21H19ClFNO4S
Mol. Mass.:
435.896
SMILES:
CS(=O)(=O)c1cc(F)cc2c3CC[C@H](CC(O)=O)c3n(Cc3ccc(Cl)cc3)c12
: