Target
Ribosomal protein S6 kinase alpha-3
Ligand
BDBM50205472
Substrate
Meas. Tech.
ChEMBL_442370 (CHEMBL892532)
Ki
>2000±n/a nM
Citation
 Chen, SChen, LLe, NTZhao, CSidduri, ALou, JPMichoud, CPortland, LJackson, NLiu, JJKonzelmann, FChi, FTovar, CXiang, QChen, YWen, YVassilev, LT Synthesis and activity of quinolinyl-methylene-thiazolinones as potent and selective cyclin-dependent kinase 1 inhibitors. Bioorg Med Chem Lett 17:2134-8 (2007)  
Target
Name:
Ribosomal protein S6 kinase alpha-3
Synonyms:
90 kDa ribosomal protein S6 kinase 3 ISPK1 MAP kinase-activated protein kinase 1b RPS6KA3 RSK2 Ribosomal protein S6 kinase Ribosomal protein S6 kinase alpha-3 (RSK2) S6K-alpha 3 p90 ribosomal s6 kinase (RSK2) p90RSK | pp90RSK2
Type:
Serine/threonine-protein kinase
Mol. Mass.:
83740.03
Organism:
Homo sapiens (Human)
Description:
The human RSK2 sequence differed from the Genbank entry NM_004586 at one residue, V45G. The protein was cloned and purified from baculovirus expression system.
Residue:
740
  
Inhibitor
Name:
BDBM50205472
Synonyms:
(5Z)-5-(quinolin-6-ylmethylidene)-2-[(thiophen-2-ylmethyl)amino]-1,3-thiazol-4(5H)-one CHEMBL261644 | CHEMBL393929
Type:
Small organic molecule
Emp. Form.:
C18H13N3OS2
Mol. Mass.:
351.445
SMILES:
O=C1N=C(NCc2cccs2)SC1=Cc1ccc2ncccc2c1
: