Target
Kappa-type opioid receptor
Ligand
BDBM50205684
Substrate
Meas. Tech.
ChEMBL_438435 (CHEMBL887536)
Ki
0.27±n/a nM
Citation
 Chu, GHGu, MCassel, JABelanger, SGraczyk, TMDeHaven, RNConway-James, NKoblish, MLittle, PJDeHaven-Hudkins, DLDolle, RE Novel malonamide derivatives as potent kappa opioid receptor agonists. Bioorg Med Chem Lett 17:1951-5 (2007)  
Target
Name:
Kappa-type opioid receptor
Synonyms:
K-OR-1 Kappa-opioid receptor (KOR) Kappa-type opioid receptor (KOR) OPIATE Kappa OPRK1 kappa opioid receptor (KOR)
Type:
G Protein-Coupled Receptor (GPCR)
Mol. Mass.:
42648.76
Organism:
Homo sapiens (Human)
Description:
P41145
Residue:
380
  
Inhibitor
Name:
BDBM50205684
Synonyms:
CHEMBL230288 | N1-((S)-2-((S)-3-hydroxypyrrolidin-1-yl)-1-phenylethyl)-N1-methyl-N3-phenylmalonamide
Type:
Small organic molecule
Emp. Form.:
C22H27N3O3
Mol. Mass.:
381.4681
SMILES:
CN([C@H](CN1CC[C@H](O)C1)c1ccccc1)C(=O)CC(=O)Nc1ccccc1
: