Target
Delta-type opioid receptor
Ligand
BDBM50205834
Substrate
Meas. Tech.
ChEMBL_428456 (CHEMBL918957)
IC50
0.275±n/a nM
Citation
 Berezowska, IChung, NNLemieux, CWilkes, BCSchiller, PW Dicarba analogues of the cyclic enkephalin peptides H-Tyr-c[D-Cys-Gly-Phe-D(or L)-Cys]NH(2) retain high opioid activity. J Med Chem 50:1414-7 (2007)  
Target
Name:
Delta-type opioid receptor
Synonyms:
DOR-1 MSL-2 OPRD_MOUSE Oprd1
Type:
Enzyme Catalytic Domain
Mol. Mass.:
40577.25
Organism:
MOUSE
Description:
P32300
Residue:
372
  
Inhibitor
Name:
BDBM50205834
Synonyms:
CHEMBL220333 H-Tyr-c[D-Allylgly-Gly-Phe-L-Allylgly]NH2
Type:
Small organic molecule
Emp. Form.:
C28H34N6O6
Mol. Mass.:
550.6062
SMILES:
N[C@@H](Cc1ccc(O)cc1)C(=O)N[C@@H]1CC=CC[C@H](NC(=O)[C@H](Cc2ccccc2)NC(=O)CNC1=O)C(N)=O
: