Target
Nitric oxide synthase, inducible
Ligand
BDBM50205906
Substrate
Meas. Tech.
ChEMBL_428500 (CHEMBL920402)
IC50
23±n/a nM
Citation
 Davey, DDAdler, MArnaiz, DEagen, KErickson, SGuilford, WKenrick, MMorrissey, MMOhlmeyer, MPan, GParadkar, VMParkinson, JPolokoff, MSaionz, KSantos, CSubramanyam, BVergona, RWei, RGWhitlow, MYe, BZhao, ZSDevlin, JJPhillips, G Design, synthesis, and activity of 2-imidazol-1-ylpyrimidine derived inducible nitric oxide synthase dimerization inhibitors. J Med Chem 50:1146-57 (2007)  
Target
Name:
Nitric oxide synthase, inducible
Synonyms:
HEP-NOS Inducible NO synthase NOS type II NOS2A Nitric oxide synthase, inducible (iNOS) | iNOS
Type:
Homodimer
Mol. Mass.:
131141.95
Organism:
Homo sapiens (Human)
Description:
P35228
Residue:
1153
  
Inhibitor
Name:
BDBM50205906
Synonyms:
1-[2-(1H-imidazol-1-yl)pyrimidin-4-yl]-N-[(4-methylphenyl)-methyl]-2-piperidineacetamide | CHEMBL223043
Type:
Small organic molecule
Emp. Form.:
C22H26N6O
Mol. Mass.:
390.4814
SMILES:
Cc1ccc(CNC(=O)CC2CCCCN2c2ccnc(n2)-n2ccnc2)cc1
: