Target
Nitric oxide synthase, inducible
Ligand
BDBM50205950
Substrate
Meas. Tech.
ChEMBL_428500 (CHEMBL920402)
IC50
0.28±n/a nM
Citation
 Davey, DDAdler, MArnaiz, DEagen, KErickson, SGuilford, WKenrick, MMorrissey, MMOhlmeyer, MPan, GParadkar, VMParkinson, JPolokoff, MSaionz, KSantos, CSubramanyam, BVergona, RWei, RGWhitlow, MYe, BZhao, ZSDevlin, JJPhillips, G Design, synthesis, and activity of 2-imidazol-1-ylpyrimidine derived inducible nitric oxide synthase dimerization inhibitors. J Med Chem 50:1146-57 (2007)  
Target
Name:
Nitric oxide synthase, inducible
Synonyms:
HEP-NOS Inducible NO synthase NOS type II NOS2A Nitric oxide synthase, inducible (iNOS) | iNOS
Type:
Homodimer
Mol. Mass.:
131141.95
Organism:
Homo sapiens (Human)
Description:
P35228
Residue:
1153
  
Inhibitor
Name:
BDBM50205950
Synonyms:
2-((R)-1-(2-(1H-imidazol-1-yl)pyrimidin-4-yl)pyrrolidin-2-yl)-N-(benzo[d][1,3]dioxol-5-ylmethyl)acetamide | CHEMBL376733
Type:
Small organic molecule
Emp. Form.:
C21H22N6O3
Mol. Mass.:
406.4378
SMILES:
O=C(C[C@H]1CCCN1c1ccnc(n1)-n1ccnc1)NCc1ccc2OCOc2c1
: