Target
Nitric oxide synthase, inducible
Ligand
BDBM50205959
Substrate
Meas. Tech.
ChEMBL_428500 (CHEMBL920402)
IC50
34±n/a nM
Citation
 Davey, DDAdler, MArnaiz, DEagen, KErickson, SGuilford, WKenrick, MMorrissey, MMOhlmeyer, MPan, GParadkar, VMParkinson, JPolokoff, MSaionz, KSantos, CSubramanyam, BVergona, RWei, RGWhitlow, MYe, BZhao, ZSDevlin, JJPhillips, G Design, synthesis, and activity of 2-imidazol-1-ylpyrimidine derived inducible nitric oxide synthase dimerization inhibitors. J Med Chem 50:1146-57 (2007)  
Target
Name:
Nitric oxide synthase, inducible
Synonyms:
HEP-NOS Inducible NO synthase NOS type II NOS2A Nitric oxide synthase, inducible (iNOS) | iNOS
Type:
Homodimer
Mol. Mass.:
131141.95
Organism:
Homo sapiens (Human)
Description:
P35228
Residue:
1153
  
Inhibitor
Name:
BDBM50205959
Synonyms:
(3R)-methyl 4-(2-(1H-imidazol-1-yl)pyrimidin-4-yl)-3-(2-(benzo[d][1,3]dioxol-5-ylmethylamino)-2-oxoethyl)piperazine-1-carboxylate | CHEMBL220511
Type:
Small organic molecule
Emp. Form.:
C23H25N7O5
Mol. Mass.:
479.4885
SMILES:
COC(=O)N1CCN([C@H](CC(=O)NCc2ccc3OCOc3c2)C1)c1ccnc(n1)-n1ccnc1
: