Target
Nitric oxide synthase, inducible
Ligand
BDBM50205954
Substrate
Meas. Tech.
ChEMBL_428500 (CHEMBL920402)
IC50
0.5±n/a nM
Citation
 Davey, DDAdler, MArnaiz, DEagen, KErickson, SGuilford, WKenrick, MMorrissey, MMOhlmeyer, MPan, GParadkar, VMParkinson, JPolokoff, MSaionz, KSantos, CSubramanyam, BVergona, RWei, RGWhitlow, MYe, BZhao, ZSDevlin, JJPhillips, G Design, synthesis, and activity of 2-imidazol-1-ylpyrimidine derived inducible nitric oxide synthase dimerization inhibitors. J Med Chem 50:1146-57 (2007)  
Target
Name:
Nitric oxide synthase, inducible
Synonyms:
HEP-NOS Inducible NO synthase NOS type II NOS2A Nitric oxide synthase, inducible (iNOS) | iNOS
Type:
Homodimer
Mol. Mass.:
131141.95
Organism:
Homo sapiens (Human)
Description:
P35228
Residue:
1153
  
Inhibitor
Name:
BDBM50205954
Synonyms:
CHEMBL385334 | N-[(1,3-benzodioxol-5-yl)methyl]-1-[2-(1H-imidazol-1-yl)pyrimidin-4-yl]-4-(phenylcarbonyl)-2-piperazineacetamide
Type:
Small organic molecule
Emp. Form.:
C28H27N7O4
Mol. Mass.:
525.5585
SMILES:
O=C(CC1CN(CCN1c1ccnc(n1)-n1ccnc1)C(=O)c1ccccc1)NCc1ccc2OCOc2c1
: