Target
Oxytocin receptor
Ligand
BDBM50205995
Substrate
Meas. Tech.
ChEMBL_442464 (CHEMBL892629)
IC50
176±n/a nM
Citation
 Fragiadaki, MMagafa, VBorovicková, LSlaninová, JCordopatis, P Synthesis and biological activity of oxytocin analogues containing conformationally-restricted residues in position 7. Eur J Med Chem 42:799-806 (2007)  
Target
Name:
Oxytocin receptor
Synonyms:
OT-R OXYR_HUMAN | Oxytocin
Type:
Enzyme Catalytic Domain
Mol. Mass.:
42793.26
Organism:
Homo sapiens (Human)
Description:
Oxytocin OXTR HEK293::B2R9L7
Residue:
389
  
Inhibitor
Name:
BDBM50205995
Synonyms:
CHEMBL234377 | [Mpa1, D-Tyr(Et)2, L-Tic7]OT
Type:
Small organic molecule
Emp. Form.:
C50H71N11O12S2
Mol. Mass.:
1082.295
SMILES:
CCOc1ccc(C[C@@H]2NC(=O)CCSSC[C@H](NC(=O)[C@H](CC(N)=O)NC(=O)[C@H](CCC(N)=O)NC(=O)[C@@H](NC2=O)[C@@H](C)CC)C(=O)N2Cc3ccccc3C[C@H]2C(=O)N[C@@H](CC(C)C)C(=O)NCC(N)=O)cc1
: