Target
Xanthine dehydrogenase/oxidase
Ligand
BDBM34571
Substrate
Meas. Tech.
ChEMBL_442471 (CHEMBL892636)
IC50
8200±n/a nM
Citation
 Ferrari, AMSgobba, MGamberini, MCRastelli, G Relationship between quantum-chemical descriptors of proton dissociation and experimental acidity constants of various hydroxylated coumarins. Identification of the biologically active species for xanthine oxidase inhibition. Eur J Med Chem 42:1028-31 (2007)  
Target
Name:
Xanthine dehydrogenase/oxidase
Synonyms:
XD XDHA XO Xanthine dehydrogenase/oxidase | Xanthine oxidase
Type:
Enzyme
Mol. Mass.:
146441.21
Organism:
Homo sapiens (Human)
Description:
P47989
Residue:
1333
  
Inhibitor
Name:
BDBM34571
Synonyms:
6,7-bis(oxidanyl)chromen-2-one 6,7-dihydroxychromen-2-one MLS000069479 cid_5281416 | esculetin
Type:
Small organic molecule
Emp. Form.:
C9H6O4
Mol. Mass.:
178.1415
SMILES:
Oc1cc2ccc(=O)oc2cc1O
: