Target
Dipeptidyl peptidase 4
Ligand
BDBM50206058
Substrate
Meas. Tech.
ChEMBL_454659 (CHEMBL886679)
IC50
1.4±n/a nM
Citation
 Yoshida, TSakashita, HAkahoshi, FHayashi, Y [(S)-gamma-(4-Aryl-1-piperazinyl)-l-prolyl]thiazolidines as a novel series of highly potent and long-lasting DPP-IV inhibitors. Bioorg Med Chem Lett 17:2618-21 (2007)  
Target
Name:
Dipeptidyl peptidase 4
Synonyms:
Bile canaliculus domain-specific membrane glycoprotein Cd26 DPP4_RAT Dipeptidyl peptidase 4 Dipeptidyl peptidase 4 60 kDa soluble form Dipeptidyl peptidase 4 soluble form Dipeptidyl peptidase IV 60 kDa soluble form Dipeptidyl peptidase IV soluble form GP110 glycoprotein | T-cell activation antigen CD26
Type:
Enzyme
Mol. Mass.:
88084.94
Organism:
Rattus norvegicus (rat)
Description:
Residue:
767
  
Inhibitor
Name:
BDBM50206058
Synonyms:
6-(4-((3S,5S)-5-(thiazolidine-3-carbonyl)pyrrolidin-3-yl)piperazin-1-yl)nicotinonitrile | CHEMBL241253
Type:
Small organic molecule
Emp. Form.:
C18H24N6OS
Mol. Mass.:
372.488
SMILES:
O=C([C@@H]1C[C@@H](CN1)N1CCN(CC1)c1ccc(cn1)C#N)N1CCSC1
: