Target
Dipeptidyl peptidase 4
Ligand
BDBM50206039
Substrate
Meas. Tech.
ChEMBL_454659 (CHEMBL886679)
IC50
10.3±n/a nM
Citation
 Yoshida, TSakashita, HAkahoshi, FHayashi, Y [(S)-gamma-(4-Aryl-1-piperazinyl)-l-prolyl]thiazolidines as a novel series of highly potent and long-lasting DPP-IV inhibitors. Bioorg Med Chem Lett 17:2618-21 (2007)  
Target
Name:
Dipeptidyl peptidase 4
Synonyms:
Bile canaliculus domain-specific membrane glycoprotein Cd26 DPP4_RAT Dipeptidyl peptidase 4 Dipeptidyl peptidase 4 60 kDa soluble form Dipeptidyl peptidase 4 soluble form Dipeptidyl peptidase IV 60 kDa soluble form Dipeptidyl peptidase IV soluble form GP110 glycoprotein | T-cell activation antigen CD26
Type:
Enzyme
Mol. Mass.:
88084.94
Organism:
Rattus norvegicus (rat)
Description:
Residue:
767
  
Inhibitor
Name:
BDBM50206039
Synonyms:
((2S,4S)-4-(4-(4-chlorophenyl)piperazin-1-yl)pyrrolidin-2-yl)(thiazolidin-3-yl)methanone | CHEMBL238507
Type:
Small organic molecule
Emp. Form.:
C18H25ClN4OS
Mol. Mass.:
380.935
SMILES:
Clc1ccc(cc1)N1CCN(CC1)[C@@H]1CN[C@@H](C1)C(=O)N1CCSC1
: