Target
Histamine H3 receptor
Ligand
BDBM50206229
Substrate
Meas. Tech.
ChEMBL_454704 (CHEMBL886726)
Ki
0.7±n/a nM
Citation
 Keith, JMGomez, LAWolin, RLBarbier, AJWilson, SJBoggs, JDMazur, CFraser, ICLord, BAluisio, LLovenberg, TWCarruthers, NI Pyrrolidino-tetrahydroisoquinolines as potent dual H3 antagonist and serotonin transporter inhibitors. Bioorg Med Chem Lett 17:2603-7 (2007)  
Target
Name:
Histamine H3 receptor
Synonyms:
G-protein coupled receptor 97 HH3R HRH3 Histamine H3 receptor (H3) Histamine receptor (H3 and H4)
Type:
G Protein-Coupled Receptor (GPCR)
Mol. Mass.:
48691.47
Organism:
Homo sapiens (Human)
Description:
Binding assays were using CHO cells stably expressing hH3R receptors.
Residue:
445
  
Inhibitor
Name:
BDBM50206229
Synonyms:
3-(9-(3-(piperidin-1-yl)propoxy)-1,2,3,5,6,10b-hexahydropyrrolo[2,1-a]isoquinolin-6-yl)phenol | CHEMBL391669
Type:
Small organic molecule
Emp. Form.:
C26H34N2O2
Mol. Mass.:
406.5604
SMILES:
Oc1cccc(c1)C1CN2CCCC2c2cc(OCCCN3CCCCC3)ccc12
: