Target
Vascular endothelial growth factor receptor 2
Ligand
BDBM50206271
Substrate
Meas. Tech.
ChEMBL_442539 (CHEMBL892704)
IC50
26±n/a nM
Citation
 Huang, SLi, RConnolly, PJEmanuel, SFuentes-Pesquera, AAdams, MGruninger, RHSeraj, JMiddleton, SADavis, JMMoffat, DF Synthesis and biological study of 2-amino-4-aryl-5-chloropyrimidine analogues as inhibitors of VEGFR-2 and cyclin dependent kinase 1 (CDK1). Bioorg Med Chem Lett 17:2179-83 (2007)  
Target
Name:
Vascular endothelial growth factor receptor 2
Synonyms:
CD_antigen=CD309 Fetal liver kinase 1 (FLK-1) KDR Protein-tyrosine kinase receptor Flk-1 VEGFR-2 VEGFR2 Vascular Endothelial Growth Factor Receptor Kinase 2 Vascular endothelial growth factor receptor 2 (KDR) Vascular endothelial growth factor receptor 2 (VEGFR2) Vascular endothelial growth factor receptor-2 (VEGFR-2)
Type:
Receptor Tyrosine Kinase
Mol. Mass.:
151510.97
Organism:
Homo sapiens (Human)
Description:
P35968
Residue:
1356
  
Inhibitor
Name:
BDBM50206271
Synonyms:
4-(4-(2-aminopropan-2-yl)phenyl)-5-chloro-N-(4-(2-(pyrrolidin-1-yl)ethyl)phenyl)pyrimidin-2-amine | CHEMBL233208
Type:
Small organic molecule
Emp. Form.:
C25H30ClN5
Mol. Mass.:
435.992
SMILES:
CC(C)(N)c1ccc(cc1)-c1nc(Nc2ccc(CCN3CCCC3)cc2)ncc1Cl
: