Target
M1 family aminopeptidase
Ligand
BDBM50206552
Substrate
Meas. Tech.
ChEMBL_428661 (CHEMBL915808)
IC50
130±n/a nM
Citation
 Flipo, MBeghyn, TLeroux, VFlorent, IDeprez, BPDeprez-Poulain, RF Novel selective inhibitors of the zinc plasmodial aminopeptidase PfA-M1 as potential antimalarial agents. J Med Chem 50:1322-34 (2007)  
Target
Name:
M1 family aminopeptidase
Synonyms:
AMPN_PLAF7 Zinc aminopeptidase | m1-family aminopeptidase
Type:
PROTEIN
Mol. Mass.:
126072.31
Organism:
Plasmodium falciparum (isolate FcB1 / Columbia)
Description:
ChEMBL_735637
Residue:
1085
  
Inhibitor
Name:
BDBM50206552
Synonyms:
2-(3-phenoxybenzyl)-N1-(4-chlorobenzyl)-N3-hydroxymalonamide N-(4-chloro-benzyl)-N'-hydroxy-2-(3-phenoxy-benzyl)-malonamide
Type:
Small organic molecule
Emp. Form.:
C23H21ClN2O4
Mol. Mass.:
424.877
SMILES:
ONC(=O)C(Cc1cccc(Oc2ccccc2)c1)C(=O)NCc1ccc(Cl)cc1
: