Target
Mu-type opioid receptor
Ligand
BDBM50206656
Substrate
Meas. Tech.
ChEMBL_438449 (CHEMBL887549)
Ki
5100±n/a nM
Citation
 Lee, YSNyberg, JMoye, SAgnes, RSDavis, PMa, SWLai, JPorreca, FVardanyan, RHruby, VJ Understanding the structural requirements of 4-anilidopiperidine analogues for biological activities at mu and delta opioid receptors. Bioorg Med Chem Lett 17:2161-5 (2007)  
Target
Name:
Mu-type opioid receptor
Synonyms:
MOR-1 Mu-type opioid receptor (MOR) OPRM_RAT Opioid receptor B Ror-b
Type:
G Protein-Coupled Receptor (GPCR)
Mol. Mass.:
44503.11
Organism:
Rattus norvegicus (rat)
Description:
Competition binding assays were carried out using membrane preparations from transfected HN9.10 cells that constitutively expressed the mu opioid receptor.
Residue:
398
  
Inhibitor
Name:
BDBM50206656
Synonyms:
(R)-N-(1-(2-amino-2-phenylacetyl)piperidin-4-yl)-N-phenylpropionamide | CHEMBL230312
Type:
Small organic molecule
Emp. Form.:
C22H27N3O2
Mol. Mass.:
365.4687
SMILES:
CCC(=O)N(C1CCN(CC1)C(=O)[C@H](N)c1ccccc1)c1ccccc1
: