Target
Delta-type opioid receptor
Ligand
BDBM50207191
Substrate
Meas. Tech.
ChEMBL_443019 (CHEMBL892151)
Ki
2.64±n/a nM
Citation
 Balboni, GOnnis, VCongiu, CZotti, MSasaki, YAmbo, ABryant, SDJinsmaa, YLazarus, LHLazzari, ITrapella, CSalvadori, S Further studies on the effect of lysine at the C-terminus of the Dmt-Tic opioid pharmacophore. Bioorg Med Chem 15:3143-51 (2007)  
Target
Name:
Delta-type opioid receptor
Synonyms:
Cytochrome P450 3A4 Delta opioid receptor Delta-type opioid receptor (DOR) OPRD_RAT Opioid receptor Opioid receptors; mu & delta Ror-a | Voltage-gated potassium channel
Type:
G Protein-Coupled Receptor (GPCR)
Mol. Mass.:
40465.04
Organism:
Rattus norvegicus (rat)
Description:
Competition binding assays were using CHO-K1 cell membranes expressing the opioid receptor.
Residue:
372
  
Inhibitor
Name:
BDBM50207191
Synonyms:
(S)-2-((S)-2-amino-3-(4-hydroxy-2,6-dimethylphenyl)propanoyl)-N-((S)-5-amino-5-(1H-benzo[d]imidazol-2-yl)pentyl)-1,2,3,4-tetrahydroisoquinoline-3-carboxamide | CHEMBL232815
Type:
Small organic molecule
Emp. Form.:
C33H40N6O3
Mol. Mass.:
568.7091
SMILES:
Cc1cc(O)cc(C)c1C[C@H](N)C(=O)N1Cc2ccccc2C[C@H]1C(=O)NCCCC[C@H](N)c1nc2ccccc2[nH]1
: