Target
Receptor-type tyrosine-protein kinase FLT3
Ligand
BDBM50207475
Substrate
Meas. Tech.
ChEMBL_429057 (CHEMBL920440)
IC50
14±n/a nM
Citation
 Dai, YHartandi, KJi, ZAhmed, AAAlbert, DHBauch, JLBouska, JJBousquet, PFCunha, GAGlaser, KBHarris, CMHickman, DGuo, JLi, JMarcotte, PAMarsh, KCMoskey, MDMartin, RLOlson, AMOsterling, DJPease, LJSoni, NBStewart, KDStoll, VSTapang, PReuter, DRDavidsen, SKMichaelides, MR Discovery of N-(4-(3-amino-1H-indazol-4-yl)phenyl)-N'-(2-fluoro-5-methylphenyl)urea (ABT-869), a 3-aminoindazole-based orally active multitargeted receptor tyrosine kinase inhibitor. J Med Chem 50:1584-97 (2007)  
Target
Name:
Receptor-type tyrosine-protein kinase FLT3
Synonyms:
CD135 FL cytokine receptor FLK2 FLT3 Fetal liver kinase-2 Fms-like tyrosine kinase 3 (Flt-3) STK-1 Stem cell tyrosine kinase 1
Type:
Enzyme
Mol. Mass.:
112888.62
Organism:
Homo sapiens (Human)
Description:
P36888
Residue:
993
  
Inhibitor
Name:
BDBM50207475
Synonyms:
1-(4-(3-amino-7-fluoro-1H-indazol-4-yl)phenyl)-3-m-tolylurea N-[4-(3-amino-7-fluoro-1H-indazol-4-yl)phenyl]-N'-(3-methylphenyl)urea
Type:
Small organic molecule
Emp. Form.:
C21H18FN5O
Mol. Mass.:
375.3989
SMILES:
Cc1cccc(NC(=O)Nc2ccc(cc2)-c2ccc(F)c3[nH]nc(N)c23)c1
: