Target
Vascular endothelial growth factor receptor 2
Ligand
BDBM50207497
Substrate
Meas. Tech.
ChEMBL_429059 (CHEMBL920442)
IC50
31±n/a nM
Citation
 Dai, YHartandi, KJi, ZAhmed, AAAlbert, DHBauch, JLBouska, JJBousquet, PFCunha, GAGlaser, KBHarris, CMHickman, DGuo, JLi, JMarcotte, PAMarsh, KCMoskey, MDMartin, RLOlson, AMOsterling, DJPease, LJSoni, NBStewart, KDStoll, VSTapang, PReuter, DRDavidsen, SKMichaelides, MR Discovery of N-(4-(3-amino-1H-indazol-4-yl)phenyl)-N'-(2-fluoro-5-methylphenyl)urea (ABT-869), a 3-aminoindazole-based orally active multitargeted receptor tyrosine kinase inhibitor. J Med Chem 50:1584-97 (2007)  
Target
Name:
Vascular endothelial growth factor receptor 2
Synonyms:
CD_antigen=CD309 Fetal liver kinase 1 (FLK-1) KDR Protein-tyrosine kinase receptor Flk-1 VEGFR-2 VEGFR2 Vascular Endothelial Growth Factor Receptor Kinase 2 Vascular endothelial growth factor receptor 2 (KDR) Vascular endothelial growth factor receptor 2 (VEGFR2) Vascular endothelial growth factor receptor-2 (VEGFR-2)
Type:
Receptor Tyrosine Kinase
Mol. Mass.:
151510.97
Organism:
Homo sapiens (Human)
Description:
P35968
Residue:
1356
  
Inhibitor
Name:
BDBM50207497
Synonyms:
1-(4-(3-amino-7-(2-(pyrrolidin-1-yl)ethoxy)-1H-indazol-4-yl)phenyl)-3-m-tolylurea N-{4-[3-amino-7-(2-pyrrolidin-1-yl-ethoxy)-1H-indazol-4-yl]-phenyl}-N'-(3-methylphenyl)urea
Type:
Small organic molecule
Emp. Form.:
C27H30N6O2
Mol. Mass.:
470.5661
SMILES:
Cc1cccc(NC(=O)Nc2ccc(cc2)-c2ccc(OCCN3CCCC3)c3[nH]nc(N)c23)c1
: