Target
Glycylpeptide N-tetradecanoyltransferase
Ligand
BDBM50109882
Substrate
Meas. Tech.
ChEMBL_458963 (CHEMBL925057)
IC50
5.7±n/a nM
Citation
 Sheng, CZhu, JZhang, WZhang, MJi, HSong, YXu, HYao, JMiao, ZZhou, YZhu, JLü, J 3D-QSAR and molecular docking studies on benzothiazole derivatives as Candida albicans N-myristoyltransferase inhibitors. Eur J Med Chem 42:477-86 (2007)  
Target
Name:
Glycylpeptide N-tetradecanoyltransferase
Synonyms:
2.3.1.97 Myristoyl-CoA:protein N-myristoyltransferase Myristoyl-CoA:protein N-myristoyltransferase (Nmt D112A)) Myristoyl-CoA:protein N-myristoyltransferase (Nmt F115A)) Myristoyl-CoA:protein N-myristoyltransferase (Nmt F240A)) Myristoyl-CoA:protein N-myristoyltransferase (Nmt F339S)) Myristoyl-CoA:protein N-myristoyltransferase (Nmt H227A)) Myristoyl-CoA:protein N-myristoyltransferase (Nmt I352A)) Myristoyl-CoA:protein N-myristoyltransferase (Nmt L451A)) Myristoyl-CoA:protein N-myristoyltransferase (Nmt N175A)) Myristoyl-CoA:protein N-myristoyltransferase (Nmt S241A)) Myristoyl-CoA:protein N-myristoyltransferase (Nmt T211A)) Myristoyl-CoA:protein N-myristoyltransferase (Nmt W232A)) Myristoyl-CoA:protein N-myristoyltransferase (Nmt Y119A)) Myristoyl-CoA:protein N-myristoyltransferase (Nmt Y256A)) Myristoyl-CoA:protein N-myristoyltransferase (Nmt) NMT1 Peptide N-myristoyltransferase | Peptide N-myristoyltransferase 1
Type:
Enzyme
Mol. Mass.:
51875.96
Organism:
Candida albicans (Yeast)
Description:
P30418
Residue:
451
  
Inhibitor
Name:
BDBM50109882
Synonyms:
3-(3-methyl-2-((2,3,4-trifluorophenoxy)methyl)benzofuran-4-yloxy)-N-(pyridin-3-ylmethyl)propan-1-amine {3-[3-Methyl-2-(2,3,4-trifluoro-phenoxymethyl)-benzofuran-4-yloxy]-propyl}-pyridin-3-ylmethyl-amine
Type:
Small organic molecule
Emp. Form.:
C25H23F3N2O3
Mol. Mass.:
456.4569
SMILES:
Cc1c(COc2ccc(F)c(F)c2F)oc2cccc(OCCCNCc3cccnc3)c12
: