Target
Glycylpeptide N-tetradecanoyltransferase
Ligand
BDBM50207630
Substrate
Meas. Tech.
ChEMBL_458963 (CHEMBL925057)
IC50
100±n/a nM
Citation
 Sheng, CZhu, JZhang, WZhang, MJi, HSong, YXu, HYao, JMiao, ZZhou, YZhu, JLü, J 3D-QSAR and molecular docking studies on benzothiazole derivatives as Candida albicans N-myristoyltransferase inhibitors. Eur J Med Chem 42:477-86 (2007)  
Target
Name:
Glycylpeptide N-tetradecanoyltransferase
Synonyms:
2.3.1.97 Myristoyl-CoA:protein N-myristoyltransferase Myristoyl-CoA:protein N-myristoyltransferase (Nmt D112A)) Myristoyl-CoA:protein N-myristoyltransferase (Nmt F115A)) Myristoyl-CoA:protein N-myristoyltransferase (Nmt F240A)) Myristoyl-CoA:protein N-myristoyltransferase (Nmt F339S)) Myristoyl-CoA:protein N-myristoyltransferase (Nmt H227A)) Myristoyl-CoA:protein N-myristoyltransferase (Nmt I352A)) Myristoyl-CoA:protein N-myristoyltransferase (Nmt L451A)) Myristoyl-CoA:protein N-myristoyltransferase (Nmt N175A)) Myristoyl-CoA:protein N-myristoyltransferase (Nmt S241A)) Myristoyl-CoA:protein N-myristoyltransferase (Nmt T211A)) Myristoyl-CoA:protein N-myristoyltransferase (Nmt W232A)) Myristoyl-CoA:protein N-myristoyltransferase (Nmt Y119A)) Myristoyl-CoA:protein N-myristoyltransferase (Nmt Y256A)) Myristoyl-CoA:protein N-myristoyltransferase (Nmt) NMT1 Peptide N-myristoyltransferase | Peptide N-myristoyltransferase 1
Type:
Enzyme
Mol. Mass.:
51875.96
Organism:
Candida albicans (Yeast)
Description:
P30418
Residue:
451
  
Inhibitor
Name:
BDBM50207630
Synonyms:
CHEMBL401271 | tert-butyl 6-((2-(naphthalen-2-ylmethylamino)ethyl)carbamoyl)benzo[d]thiazol-2-ylcarbamate
Type:
Small organic molecule
Emp. Form.:
C26H28N4O3S
Mol. Mass.:
476.591
SMILES:
CC(C)(C)OC(=O)Nc1nc2ccc(cc2s1)C(=O)NCCNCc1ccc2ccccc2c1
: