Target
Sodium-dependent dopamine transporter
Ligand
BDBM50207755
Substrate
Meas. Tech.
ChEMBL_443084 (CHEMBL892215)
IC50
5300±n/a nM
Citation
 Roggen, HKehler, JStensbøl, TBHansen, T Synthesis of enantiomerically pure milnacipran analogs and inhibition of dopamine, serotonin, and norepinephrine transporters. Bioorg Med Chem Lett 17:2834-7 (2007)  
Target
Name:
Sodium-dependent dopamine transporter
Synonyms:
DA transporter SC6A3_RAT Sodium-dependent dopamine transporter | Sodium-dependent dopamine transporter (DAT)
Type:
Multi-pass membrane protein
Mol. Mass.:
68749.45
Organism:
Rattus norvegicus (rat)
Description:
P23977
Residue:
619
  
Inhibitor
Name:
BDBM50207755
Synonyms:
CHEMBL233645 | [(1S,2R)-2-(diethylcarbamoyl)-2-(naphthalen-1-yl)cyclopropyl]methanaminium chloride
Type:
Small organic molecule
Emp. Form.:
C19H25N2O
Mol. Mass.:
297.4141
SMILES:
CCN(CC)C(=O)[C@@]1(C[C@@H]1C[NH3+])c1cccc2ccccc12
: