Target
Angiopoietin-1 receptor
Ligand
BDBM50207849
Substrate
Meas. Tech.
ChEMBL_455047 (CHEMBL887076)
IC50
6±n/a nM
Citation
 Hodous, BLGeuns-Meyer, SDHughes, PEAlbrecht, BKBellon, SCaenepeel, SCee, VJChaffee, SCEmery, MFretland, JGallant, PGu, YJohnson, REKim, JLLong, AMMorrison, MOlivieri, PRPatel, VFPolverino, ARose, PWang, LZhao, H Synthesis, structural analysis, and SAR studies of triazine derivatives as potent, selective Tie-2 inhibitors. Bioorg Med Chem Lett 17:2886-9 (2007)  
Target
Name:
Angiopoietin-1 receptor
Synonyms:
TEK TIE2_HUMAN Tyrosine-protein kinase receptor (TIE-2) Tyrosine-protein kinase receptor TEK (p140 TEK) Tyrosine-protein kinase receptor TIE2/TEK VMCM1 p140 TEK
Type:
Enzyme
Mol. Mass.:
125835.70
Organism:
Homo sapiens (Human)
Description:
Q02763
Residue:
1124
  
Inhibitor
Name:
BDBM50207849
Synonyms:
CHEMBL246151 | N-(2-chloro-5-(3-(2-(methylamino)pyridin-4-yl)pyridin-2-yloxy)phenyl)-3-isopropylbenzamide
Type:
Small organic molecule
Emp. Form.:
C27H25ClN4O2
Mol. Mass.:
472.966
SMILES:
CNc1cc(ccn1)-c1cccnc1Oc1ccc(Cl)c(NC(=O)c2cccc(c2)C(C)C)c1
: