Target
Potassium voltage-gated channel subfamily A member 5
Ligand
BDBM50099581
Substrate
Meas. Tech.
ChEMBL_455075 (CHEMBL887104)
IC50
160±n/a nM
Citation
 Gross, MFBeaudoin, SMcNaughton-Smith, GAmato, GSCastle, NAHuang, CZou, AYu, W Aryl sulfonamido indane inhibitors of the Kv1.5 ion channel. Bioorg Med Chem Lett 17:2849-53 (2007)  
Target
Name:
Potassium voltage-gated channel subfamily A member 5
Synonyms:
HK2 KCNA5 Potassium voltage-gated channel subfamily A member 5 Voltage-gated potassium channel subunit Kv1.5
Type:
Enzyme
Mol. Mass.:
67222.47
Organism:
Homo sapiens (Human)
Description:
P22460
Residue:
613
  
Inhibitor
Name:
BDBM50099581
Synonyms:
CHEMBL288131 N-[3-(4-Ethyl-benzenesulfonylamino)-2-hydroxy-indan-5-yl]-3-methoxy-benzamide
Type:
Small organic molecule
Emp. Form.:
C25H26N2O5S
Mol. Mass.:
466.549
SMILES:
CCc1ccc(cc1)S(=O)(=O)N[C@H]1[C@H](O)Cc2ccc(NC(=O)c3cccc(OC)c3)cc12
: