Target
Glycine receptor subunit alpha-2
Ligand
BDBM50208092
Substrate
Meas. Tech.
ChEMBL_429275 (CHEMBL915382)
IC50
>100000±n/a nM
Citation
 Jensen, AABegum, NVogensen, SBKnapp, KMGundertofte, KDzyuba, SVIshii, HNakanishi, KKristiansen, UStrømgaard, K Probing the pharmacophore of ginkgolides as glycine receptor antagonists. J Med Chem 50:1610-7 (2007)  
Target
Name:
Glycine receptor subunit alpha-2
Synonyms:
GLRA2 | GLRA2_HUMAN
Type:
PROTEIN
Mol. Mass.:
52016.09
Organism:
Homo sapiens (Human)
Description:
ChEMBL_429275
Residue:
452
  
Inhibitor
Name:
BDBM50208092
Synonyms:
(1S,6R,8S,9S,11R,12R,13S,16S,17R)-8-tert-butyl-6,12,17-trihydroxy-16-methyl-5,15,18-trioxo-2,4,14,19-tetraoxahexacyclo[8.7.2.0^{1,11}.0^{3,7}.0^{7,11}.0^{13,17}]nonadecan-9-yl 2-phenylacetate | CHEMBL387106
Type:
Small organic molecule
Emp. Form.:
C28H30O12
Mol. Mass.:
558.5306
SMILES:
C[C@@H]1C(=O)O[C@H]2[C@H](O)[C@]34C5OC(=O)[C@@]3(OC3OC(=O)[C@H](O)C43[C@@H]([C@@H]5OC(=O)Cc3ccccc3)C(C)(C)C)[C@@]12O
: