Target
Nitric oxide synthase, inducible
Ligand
BDBM50208476
Substrate
Meas. Tech.
ChEMBL_443295 (CHEMBL893545)
IC50
250±n/a nM
Citation
 Wei, RGAdler, MDavey, DHo, EMohan, RPolokoff, MTseng, JLWhitlow, MXu, WYuan, SPhillips, G 1-(1,3-Benzodioxol-5-ylmethyl)-3-[4-(1H-imidazol-1-yl)phenoxy]-piperidine analogs as potent and selective inhibitors of nitric oxide formation. Bioorg Med Chem Lett 17:2499-504 (2007)  
Target
Name:
Nitric oxide synthase, inducible
Synonyms:
HEP-NOS Inducible NO synthase NOS type II NOS2A Nitric oxide synthase, inducible (iNOS) | iNOS
Type:
Homodimer
Mol. Mass.:
131141.95
Organism:
Homo sapiens (Human)
Description:
P35228
Residue:
1153
  
Inhibitor
Name:
BDBM50208476
Synonyms:
3-(4-(1H-imidazol-1-yl)phenoxy)-1-(benzo[d][1,3]dioxol-5-ylmethyl)piperidine | CHEMBL232825
Type:
Small organic molecule
Emp. Form.:
C22H23N3O3
Mol. Mass.:
377.4363
SMILES:
C(N1CCCC(C1)Oc1ccc(cc1)-n1ccnc1)c1ccc2OCOc2c1
: