Target
Cathepsin S
Ligand
BDBM50208837
Substrate
Meas. Tech.
ChEMBL_443352 (CHEMBL893600)
Kd
13.8±n/a nM
Citation
 Bekkali, YThomson, DSBetageri, REmmanuel, MJHao, MHHickey, ELiu, WPatel, UWard, YDYoung, ERNelson, RKukulka, ABrown, MLCrane, KWhite, DFreeman, DMLabadia, MEWildeson, JSpero, DM Identification of a novel class of succinyl-nitrile-based Cathepsin S inhibitors. Bioorg Med Chem Lett 17:2465-9 (2007)  
Target
Name:
Cathepsin S
Synonyms:
CATS_HUMAN Cathepsin S (Cat S) | cathepsin S preproprotein
Type:
Protein
Mol. Mass.:
37507.38
Organism:
Homo sapiens (Human)
Description:
P25774
Residue:
331
  
Inhibitor
Name:
BDBM50208837
Synonyms:
(R)-N-((R)-3-cyano-1-cyclohexylpyrrolidin-3-yl)-2-((4-methylcyclohexyl)methyl)-4-morpholino-4-oxobutanamide | CHEMBL234696
Type:
Small organic molecule
Emp. Form.:
C27H44N4O3
Mol. Mass.:
472.6633
SMILES:
CC1CCC(C[C@H](CC(=O)N2CCOCC2)C(=O)N[C@@]2(CCN(C2)C2CCCCC2)C#N)CC1
: