Target
Cathepsin S
Ligand
BDBM50208850
Substrate
Meas. Tech.
ChEMBL_443352 (CHEMBL893600)
Kd
161±n/a nM
Citation
 Bekkali, YThomson, DSBetageri, REmmanuel, MJHao, MHHickey, ELiu, WPatel, UWard, YDYoung, ERNelson, RKukulka, ABrown, MLCrane, KWhite, DFreeman, DMLabadia, MEWildeson, JSpero, DM Identification of a novel class of succinyl-nitrile-based Cathepsin S inhibitors. Bioorg Med Chem Lett 17:2465-9 (2007)  
Target
Name:
Cathepsin S
Synonyms:
CATS_HUMAN Cathepsin S (Cat S) | cathepsin S preproprotein
Type:
Protein
Mol. Mass.:
37507.38
Organism:
Homo sapiens (Human)
Description:
P25774
Residue:
331
  
Inhibitor
Name:
BDBM50208850
Synonyms:
(R)-N-((R)-3-cyano-1-methylpyrrolidin-3-yl)-2-(cyclohexylmethyl)-4-morpholino-4-oxobutanamide | CHEMBL395012
Type:
Small organic molecule
Emp. Form.:
C21H34N4O3
Mol. Mass.:
390.5197
SMILES:
CN1CC[C@](C1)(NC(=O)[C@H](CC1CCCCC1)CC(=O)N1CCOCC1)C#N
: