Target
ATP-citrate synthase
Ligand
BDBM50209017
Substrate
Meas. Tech.
ChEMBL_455196 (CHEMBL906357)
IC50
8100±n/a nM
Citation
 Li, JJWang, HTino, JARobl, JAHerpin, TFLawrence, RMBiller, SJamil, HPonticiello, RChen, LChu, CHFlynn, NCheng, DZhao, RChen, BSchnur, DObermeier, MTSasseville, VPadmanabha, RPike, KHarrity, T 2-hydroxy-N-arylbenzenesulfonamides as ATP-citrate lyase inhibitors. Bioorg Med Chem Lett 17:3208-11 (2007)  
Target
Name:
ATP-citrate synthase
Synonyms:
ACLY | ACLY_HUMAN
Type:
PROTEIN
Mol. Mass.:
120848.43
Organism:
Homo sapiens (Human)
Description:
ChEMBL_455196
Residue:
1101
  
Inhibitor
Name:
BDBM50209017
Synonyms:
3,5-dichloro-2-hydroxy-N-(3-phenoxyphenyl)benzenesulfonamide | CHEMBL250745
Type:
Small organic molecule
Emp. Form.:
C18H13Cl2NO4S
Mol. Mass.:
410.271
SMILES:
Oc1c(Cl)cc(Cl)cc1S(=O)(=O)Nc1cccc(Oc2ccccc2)c1
: