Target
Macrophage migration inhibitory factor
Ligand
BDBM50209082
Substrate
Meas. Tech.
ChEMBL_429520 (CHEMBL918061)
IC50
>500000±n/a nM
Citation
 Dabideen, DRCheng, KFAljabari, BMiller, EJPavlov, VAAl-Abed, Y Phenolic hydrazones are potent inhibitors of macrophage migration inhibitory factor proinflammatory activity and survival improving agents in sepsis. J Med Chem 50:1993-7 (2007)  
Target
Name:
Macrophage migration inhibitory factor
Synonyms:
GIF Glycosylation-inhibiting factor L-dopachrome tautomerase MIF/CD74 (Macrophage migration inhibitory factor and HLA-DR antigens-associated invariant chain) MMIF Macrophage migration inhibitory factor (MIF) | Phenylpyruvate tautomerase
Type:
Enzyme
Mol. Mass.:
12478.18
Organism:
Homo sapiens (Human)
Description:
P14174
Residue:
115
  
Inhibitor
Name:
BDBM50209082
Synonyms:
4-hydroxybenzaldehyde hydrazone | CHEMBL222174
Type:
Small organic molecule
Emp. Form.:
C7H8N2O
Mol. Mass.:
136.1512
SMILES:
Oc1ccc(CN=N)cc1
: