Target
Macrophage migration inhibitory factor
Ligand
BDBM50113768
Substrate
Meas. Tech.
ChEMBL_429520 (CHEMBL918061)
IC50
1600±n/a nM
Citation
 Dabideen, DRCheng, KFAljabari, BMiller, EJPavlov, VAAl-Abed, Y Phenolic hydrazones are potent inhibitors of macrophage migration inhibitory factor proinflammatory activity and survival improving agents in sepsis. J Med Chem 50:1993-7 (2007)  
Target
Name:
Macrophage migration inhibitory factor
Synonyms:
GIF Glycosylation-inhibiting factor L-dopachrome tautomerase MIF/CD74 (Macrophage migration inhibitory factor and HLA-DR antigens-associated invariant chain) MMIF Macrophage migration inhibitory factor (MIF) | Phenylpyruvate tautomerase
Type:
Enzyme
Mol. Mass.:
12478.18
Organism:
Homo sapiens (Human)
Description:
P14174
Residue:
115
  
Inhibitor
Name:
BDBM50113768
Synonyms:
(S)-methyl 2-(4-hydroxybenzylideneamino)-3-(1H-indol-3-yl)propanoate CHEMBL78684
Type:
Small organic molecule
Emp. Form.:
C19H18N2O3
Mol. Mass.:
322.3578
SMILES:
COC(=O)[C@H](Cc1c[nH]c2ccccc12)\N=C\c1ccc(O)cc1
: