Target
Vascular endothelial growth factor receptor 2
Ligand
BDBM50209144
Substrate
Meas. Tech.
ChEMBL_455228 (CHEMBL906389)
IC50
270±n/a nM
Citation
 Akritopoulou-Zanze, IAlbert, DHBousquet, PFCunha, GAHarris, CMMoskey, MDinges, JStewart, KDSowin, TJ Synthesis and biological evaluation of 5-substituted 1,4-dihydroindeno[1,2-c]pyrazoles as multitargeted receptor tyrosine kinase inhibitors. Bioorg Med Chem Lett 17:3136-40 (2007)  
Target
Name:
Vascular endothelial growth factor receptor 2
Synonyms:
CD_antigen=CD309 Fetal liver kinase 1 (FLK-1) KDR Protein-tyrosine kinase receptor Flk-1 VEGFR-2 VEGFR2 Vascular Endothelial Growth Factor Receptor Kinase 2 Vascular endothelial growth factor receptor 2 (KDR) Vascular endothelial growth factor receptor 2 (VEGFR2) Vascular endothelial growth factor receptor-2 (VEGFR-2)
Type:
Receptor Tyrosine Kinase
Mol. Mass.:
151510.97
Organism:
Homo sapiens (Human)
Description:
P35968
Residue:
1356
  
Inhibitor
Name:
BDBM50209144
Synonyms:
2-(2-methoxy-ethoxy)-N-{3-[5-(3-phenoxy-prop-1-ynyl)-thiophen-3-yl]-2,4-dihydro-indeno[1,2-c]pyrazol-5-yl}-acetamide | CHEMBL245968
Type:
Small organic molecule
Emp. Form.:
C28H25N3O4S
Mol. Mass.:
499.581
SMILES:
COCCOCC(=O)Nc1cccc-2c1Cc1c-2n[nH]c1-c1csc(c1)C#CCOc1ccccc1
: