Target
Vascular endothelial growth factor receptor 1
Ligand
BDBM50209159
Substrate
Meas. Tech.
ChEMBL_455229 (CHEMBL906390)
IC50
240±n/a nM
Citation
 Akritopoulou-Zanze, IAlbert, DHBousquet, PFCunha, GAHarris, CMMoskey, MDinges, JStewart, KDSowin, TJ Synthesis and biological evaluation of 5-substituted 1,4-dihydroindeno[1,2-c]pyrazoles as multitargeted receptor tyrosine kinase inhibitors. Bioorg Med Chem Lett 17:3136-40 (2007)  
Target
Name:
Vascular endothelial growth factor receptor 1
Synonyms:
FLT FRT Fms-like tyrosine kinase 1 Tyrosine-protein kinase FRT VEGFR-1 VGFR1_HUMAN Vascular endothelial growth factor receptor 1 (FLT1) Vascular endothelial growth factor receptor 1 and 2 (Flt-1 and KDR) Vascular permeability factor receptor vascular endothelial growth factor/vascular permeability factor receptor
Type:
Receptor Tyrosine Kinase
Mol. Mass.:
150800.23
Organism:
Homo sapiens (Human)
Description:
P17948
Residue:
1338
  
Inhibitor
Name:
BDBM50209159
Synonyms:
CHEMBL246343 | [(3-thiophen-3-yl-2,4-dihydro-indeno[1,2-c]pyrazole-5-carbonyl)-amino]-acetic acid
Type:
Small organic molecule
Emp. Form.:
C17H13N3O3S
Mol. Mass.:
339.368
SMILES:
OC(=O)CNC(=O)c1cccc-2c1Cc1c-2n[nH]c1-c1ccsc1
: